BDBM50164650 CHEMBL191725::[[[3-fluoro-5-(5-methyl-2,4-dioxo-1H-pyrimidin-1-yl)-tetrahydrofuran-2-yl]methoxy-hydroxy-phosphoryl]oxy-hydroxy-phosphoryl]oxyphosphonic acid
SMILES Cc1cn([C@H]2C[C@H](F)[C@@H](COP(O)(=O)OP(O)(=O)OP(O)(O)=O)O2)c(=O)[nH]c1=O
InChI Key InChIKey=UNKRRBWXJZNMAN-XLPZGREQSA-N
Data  1 KI
  Tab Delimited (TSV)   2D SDfile   Computed 3D by Vconf -m prep SDfile
Find this compound or compounds like it in BindingDB:
Activity Spreadsheet -- Enzyme Inhibition Constant Data from BindingDB
Found 1 hit for monomerid = 50164650
TargetReverse transcriptase/RNaseH(Human immunodeficiency virus 1)
Biota
Curated by ChEMBL
LigandPNGBDBM50164650(CHEMBL191725 | [[[3-fluoro-5-(5-methyl-2,4-dioxo-1...)
Affinity DataKi:  71nM. Assay description: Inhibitory constant against HIV-1 reverse transcriptase
In DepthDetails ArticlePubMed