BDBM50165014 CHEMBL190459::Cyclopentyl-hydroxy-(4-methoxy-phenyl)-acetic acid 4-(3-aza-bicyclo[3.1.0]hex-3-yl)-but-2-ynyl ester::N-[4-(3-Aza-bicyclo[3.1.0]hex-3-yl)-but-2-ynyl]-2-cyclopentyl-2-hydroxy-2-phenyl-acetamide
SMILES COc1ccc(cc1)C(O)(C1CCCC1)C(=O)OCC#CCN1CC2CC2C1
InChI Key InChIKey=FVUJGTUMLXJKBD-UHFFFAOYSA-N
Data  2 KI
  Tab Delimited (TSV)   2D SDfile   Computed 3D by Vconf -m prep SDfile
Find this compound or compounds like it in BindingDB:
Activity Spreadsheet -- Enzyme Inhibition Constant Data from BindingDB
Found 2 hits for monomerid = 50165014
TargetMuscarinic acetylcholine receptor M3(RAT)
Ranbaxy Research Laboratories
Curated by ChEMBL
LigandPNGBDBM50165014(CHEMBL190459 | Cyclopentyl-hydroxy-(4-methoxy-phen...)
Affinity DataKi:  964nM. Assay description: Affinity for rat Muscarinic acetylcholine receptor M3
In DepthDetails ArticlePubMed
TargetMuscarinic acetylcholine receptor M2(RAT)
Ranbaxy Research Laboratories
Curated by ChEMBL
LigandPNGBDBM50165014(CHEMBL190459 | Cyclopentyl-hydroxy-(4-methoxy-phen...)
Affinity DataKi:  1.93E+3nM. Assay description: Affinity for rat Muscarinic acetylcholine receptor M2
In DepthDetails ArticlePubMed