BDBM50167911 CHEMBL3799684
SMILES CC(C)c1cc(-c2ccccc2)c2cn[nH]c2c1
InChI Key InChIKey=KEKIZDKQHXXAEP-UHFFFAOYSA-N
Data  1 IC50
  Tab Delimited (TSV)   2D SDfile   Computed 3D by Vconf -m prep SDfile
Find this compound or compounds like it in BindingDB:
Activity Spreadsheet -- Enzyme Inhibition Constant Data from BindingDB
Found 1 hit for monomerid = 50167911
TargetMicrotubule-associated protein 2(Homo sapiens (Human))
Takeda California
Curated by ChEMBL
LigandPNGBDBM50167911(CHEMBL3799684)
Affinity DataIC50:  550nM. Assay description: Reversal inhibition of full length recombinant human MetAP2 expressed in baculovirus infected insect Sf9 cells using Met-AMC as substrate measured fo...
In DepthDetails ArticlePubMed