BDBM50171115 (3-{Benzyl-[4-(difluoro-phosphono-methyl)-benzyl]-sulfamoyl}-2,6-difluoro-phenoxy)-acetic acid::CHEMBL196850
SMILES OC(=O)COc1c(F)ccc(c1F)S(=O)(=O)N(Cc1ccccc1)Cc1ccc(cc1)C(F)(F)P(O)(O)=O
InChI Key InChIKey=HAYLLDHMNIZOAB-UHFFFAOYSA-N
Data  1 IC50
  Tab Delimited (TSV)   2D SDfile   Computed 3D by Vconf -m prep SDfile
Find this compound or compounds like it in BindingDB:
Activity Spreadsheet -- Enzyme Inhibition Constant Data from BindingDB
Found 1 hit for monomerid = 50171115
TargetTyrosine-protein phosphatase non-receptor type 1(Homo sapiens (Human))
Affymax
Curated by ChEMBL
LigandPNGBDBM50171115((3-{Benzyl-[4-(difluoro-phosphono-methyl)-benzyl]-...)
Affinity DataIC50:  1.60E+3nM. Assay description: Inhibitory activity against protein tyrosine phosphatase 1B using O-methyl fluorescein monophosphate
In DepthDetails ArticlePubMed