BDBM50171957 CHEMBL3805260::US10106508, Compound I-18
SMILES CCOC(C)Oc1cc2ncnc(Nc3ccc(C)c(c3)[N+]([O-])=O)c2c2OCCOc12
InChI Key InChIKey=HWZKUDPVOFVABK-UHFFFAOYSA-N
Data  4 IC50
  Tab Delimited (TSV)   2D SDfile   Computed 3D by Vconf -m prep SDfile
Find this compound or compounds like it in BindingDB:
Activity Spreadsheet -- Enzyme Inhibition Constant Data from BindingDB
Found 4 hits for monomerid = 50171957
TargetEpidermal growth factor receptor(Homo sapiens (Human))
Beijing University Of Technology
Curated by ChEMBL
LigandPNGBDBM50171957(CHEMBL3805260 | US10106508, Compound I-18)
Affinity DataIC50:  363nM. Assay description: Inhibition of wild type EGFR (unknown origin) autophosphorylation preincubated for 30 mins followed by ATP addition measured after 1 hr by kinase-glo...
In DepthDetails ArticlePubMed
TargetEpidermal growth factor receptor [T790M](Homo sapiens (Human))
Beijing Scitech-Mq Pharmaceuticals
US Patent
LigandPNGBDBM50171957(CHEMBL3805260 | US10106508, Compound I-18)
Affinity DataIC50: <1.00E+3nM. Assay description: The sample compounds were dissolved in DMSO and diluted it to 500 μM concentration with DMSO and transferred to a dose plate. The compounds were...
In DepthDetails US Patent
TargetEpidermal growth factor receptor(Homo sapiens (Human))
Beijing University Of Technology
Curated by ChEMBL
LigandPNGBDBM50171957(CHEMBL3805260 | US10106508, Compound I-18)
Affinity DataIC50: <300nM. Assay description: The sample compounds were dissolved in DMSO and diluted it to 500 μM concentration with DMSO and transferred to a dose plate. The compounds were...
In DepthDetails US Patent
TargetEpidermal growth factor receptor(Homo sapiens (Human))
Beijing University Of Technology
Curated by ChEMBL
LigandPNGBDBM50171957(CHEMBL3805260 | US10106508, Compound I-18)
Affinity DataIC50: >1.00E+3nM. Assay description: Inhibition of EGFR T790M/L858R double mutant (unknown origin) autophosphorylation preincubated for 30 mins followed by ATP addition measured after 1 ...
In DepthDetails ArticlePubMed