BDBM50177769 CHEMBL198842::[1-(3-{2-[3-(3,4-Dichloro-phenyl)-2-methoxycarbonyl-8-azabicyclo[3.2.1]oct-8-yl]-ethylcarbamoyl}-propyl)-11,11-dimethyl-2,3,4,11-tetrahydro-1H-naphtho[2,3-g]quinolin-9-ylidene]-dimethyl-ammonium perchlorate
SMILES COC(=O)C1C2CCC(CC1c1ccc(Cl)c(Cl)c1)N2CCNC(=O)CCC[N+]1=c2cc3c(=Cc4ccc(cc4C3(C)C)N(C)C)cc2CCC1
InChI Key InChIKey=HYQGUXVDIWGTKN-UHFFFAOYSA-O
Data  4 KI
  Tab Delimited (TSV)   2D SDfile   Computed 3D by Vconf -m prep SDfile
Find this compound or compounds like it in BindingDB:
Activity Spreadsheet -- Enzyme Inhibition Constant Data from BindingDB
Found 4 hits for monomerid = 50177769
TargetSodium-dependent dopamine transporter(Homo sapiens (Human))
National Institute On Drug Abuse-Intramural Research Program
Curated by ChEMBL
LigandPNGBDBM50177769(CHEMBL198842 | [1-(3-{2-[3-(3,4-Dichloro-phenyl)-2...)
Affinity DataKi:  50nM. Assay description: Displacement of [3H]CFT from human DAT expressed in COS7 cells
In DepthDetails ArticlePubMed
TargetSodium-dependent serotonin transporter(Homo sapiens (Human))
National Institute On Drug Abuse-Intramural Research Program
Curated by ChEMBL
LigandPNGBDBM50177769(CHEMBL198842 | [1-(3-{2-[3-(3,4-Dichloro-phenyl)-2...)
Affinity DataKi:  227nM. Assay description: Displacement of [3H]5HT from human SERT expressed in COS7 cells
In DepthDetails ArticlePubMed
TargetSodium-dependent dopamine transporter(Homo sapiens (Human))
National Institute On Drug Abuse-Intramural Research Program
Curated by ChEMBL
LigandPNGBDBM50177769(CHEMBL198842 | [1-(3-{2-[3-(3,4-Dichloro-phenyl)-2...)
Affinity DataKi:  250nM. Assay description: Displacement of [3H]dopamine from human DAT expressed in COS7 cells
In DepthDetails ArticlePubMed
TargetSodium-dependent noradrenaline transporter(Homo sapiens (Human))
National Institute On Drug Abuse-Intramural Research Program
Curated by ChEMBL
LigandPNGBDBM50177769(CHEMBL198842 | [1-(3-{2-[3-(3,4-Dichloro-phenyl)-2...)
Affinity DataKi:  308nM. Assay description: Displacement of [3H]dopamine from human NET expressed in COS7 cells
In DepthDetails ArticlePubMed