BDBM50177978 3-(2-chlorophenyl)-N-{6-[3-(2-chlorophenyl)-2-cyanoacryloylamino]hexyl}-2-cyanoacrylamide::CHEMBL199185
SMILES Clc1ccccc1\C=C(/C#N)C(=O)NCCCCCCNC(=O)C(=C\c1ccccc1Cl)\C#N
InChI Key InChIKey=QDLLSAUPGXUKBW-YHARCJFQSA-N
Data  1 IC50
  Tab Delimited (TSV)   2D SDfile   Computed 3D by Vconf -m prep SDfile
Find this compound or compounds like it in BindingDB:
Activity Spreadsheet -- Enzyme Inhibition Constant Data from BindingDB
Found 1 hit for monomerid = 50177978
TargetDynamin-1(Homo sapiens (Human))
The University Of Newcastle
Curated by ChEMBL
LigandPNGBDBM50177978(3-(2-chlorophenyl)-N-{6-[3-(2-chlorophenyl)-2-cyan...)
Affinity DataIC50: >1.00E+5nM. Assay description: Inhibitory activity against dynamin1 GTPase expressed in sheep brain
In DepthDetails ArticlePubMed