BDBM50178921 9-cyclopropyl-6-fluoro-7-(4-hydroxyphenyl)isothiazolo[5,4-b]quinoline-3,4(2H,9H)-dione::CHEMBL381395
SMILES Oc1ccc(cc1)-c1cc2n(C3CC3)c3s[nH]c(=O)c3c(=O)c2cc1F
InChI Key InChIKey=DBHRNNUAKNLSTN-UHFFFAOYSA-N
Data  2 IC50
  Tab Delimited (TSV)   2D SDfile   Computed 3D by Vconf -m prep SDfile
Find this compound or compounds like it in BindingDB:
Activity Spreadsheet -- Enzyme Inhibition Constant Data from BindingDB
Found 2 hits for monomerid = 50178921
TargetDNA gyrase subunit A/B(Escherichia coli (strain K12))
Achillion Pharmaceuticals
Curated by ChEMBL
LigandPNGBDBM50178921(9-cyclopropyl-6-fluoro-7-(4-hydroxyphenyl)isothiaz...)
Affinity DataIC50:  800nM. Assay description: Inhibitory activity against wild type Escherichia coli gyrase
In DepthDetails ArticlePubMed
TargetDNA topoisomerase 4 subunit A(Staphylococcus aureus)
Achillion Pharmaceuticals
Curated by ChEMBL
LigandPNGBDBM50178921(9-cyclopropyl-6-fluoro-7-(4-hydroxyphenyl)isothiaz...)
Affinity DataIC50:  2.50E+4nM. Assay description: Inhibitory activity against wild type Staphylococcus aureus topoisomerase 4
In DepthDetails ArticlePubMed