BDBM50179496 CHEMBL3813728
SMILES Fc1cccc(COc2ccc(Nc3ncnc4ccc(NC(=S)NCCN5CCOCC5)cc34)cc2Cl)c1
InChI Key InChIKey=YDGSENSUZKXRDO-UHFFFAOYSA-N
Data  4 IC50
  Tab Delimited (TSV)   2D SDfile   Computed 3D by Vconf -m prep SDfile
Find this compound or compounds like it in BindingDB:
Activity Spreadsheet -- Enzyme Inhibition Constant Data from BindingDB
Found 4 hits for monomerid = 50179496
TargetEpidermal growth factor receptor(Homo sapiens (Human))
Harvard Medical School
Curated by ChEMBL
LigandPNGBDBM50179496(CHEMBL3813728)
Affinity DataIC50:  2.30nM. Assay description: Inhibition of recombinant human EGFR expressed in baculovirus by fluorescence based assay
In DepthDetails ArticlePubMed
TargetEpidermal growth factor receptor(Homo sapiens (Human))
Harvard Medical School
Curated by ChEMBL
LigandPNGBDBM50179496(CHEMBL3813728)
Affinity DataIC50:  267nM. Assay description: Inhibition of EGFR L858R mutant (unknown origin) expressed in mouse BaF/3 cells assessed as cell growth inhibition after 72 hrs by MTS assay
In DepthDetails ArticlePubMed
TargetEpidermal growth factor receptor(Homo sapiens (Human))
Harvard Medical School
Curated by ChEMBL
LigandPNGBDBM50179496(CHEMBL3813728)
Affinity DataIC50:  332nM. Assay description: Inhibition of wild type EGFR (unknown origin) expressed in mouse BaF/3 cells assessed as cell growth inhibition after 72 hrs by MTS assay
In DepthDetails ArticlePubMed
TargetReceptor tyrosine-protein kinase erbB-2(Homo sapiens (Human))
Harvard Medical School
Curated by ChEMBL
LigandPNGBDBM50179496(CHEMBL3813728)
Affinity DataIC50:  33nM. Assay description: Inhibition of His-tagged human recombinant Her2 (676 to 1255 residues) expressed in baculovirus by fluorescence based assay
In DepthDetails ArticlePubMed