BDBM50180266 CHEMBL3814942
SMILES CC1(C)CC(=O)C2=C(C1)N(C1=C(C2c2ccc(Cl)cc2Cl)C(=O)CC(C)(C)C1)c1ccc(cc1)C(=O)Nc1nnc(s1)S(N)(=O)=O
InChI Key InChIKey=FBDNCCJHCMPTIK-UHFFFAOYSA-N
Data  4 KI
  Tab Delimited (TSV)   2D SDfile   Computed 3D by Vconf -m prep SDfile
Find this compound or compounds like it in BindingDB:
Activity Spreadsheet -- Enzyme Inhibition Constant Data from BindingDB
Found 4 hits for monomerid = 50180266
TargetCarbonic anhydrase 2(Homo sapiens (Human))
Dumlupinar University
Curated by ChEMBL
LigandPNGBDBM50180266(CHEMBL3814942)
Affinity DataKi:  8.70nM. Assay description: Inhibition of human recombinant CA2 expressed in Escherichia coli preincubated for 15 mins by stopped-flow CO2 hydration assay
In DepthDetails ArticlePubMed
TargetCarbonic anhydrase 7(Homo sapiens (Human))
Dumlupinar University
Curated by ChEMBL
LigandPNGBDBM50180266(CHEMBL3814942)
Affinity DataKi:  29nM. Assay description: Inhibition of human recombinant membrane bound CA7 expressed in Escherichia coli preincubated for 15 mins by stopped-flow CO2 hydration assay
In DepthDetails ArticlePubMed
TargetCarbonic anhydrase 1(Homo sapiens (Human))
Dumlupinar University
Curated by ChEMBL
LigandPNGBDBM50180266(CHEMBL3814942)
Affinity DataKi:  129nM. Assay description: Inhibition of human recombinant CA1 expressed in Escherichia coli preincubated for 15 mins by stopped-flow CO2 hydration assay
In DepthDetails ArticlePubMed
TargetCarbonic anhydrase 4(Homo sapiens (Human))
Dumlupinar University
Curated by ChEMBL
LigandPNGBDBM50180266(CHEMBL3814942)
Affinity DataKi:  139nM. Assay description: Inhibition of human recombinant CA4 expressed in Escherichia coli preincubated for 15 mins by stopped-flow CO2 hydration assay
In DepthDetails ArticlePubMed