BDBM50181079 CHEMBL207097::N-(2-(3-chlorobenzyloxy)-6-methylpyridin-4-yl)-N-methylpyrimidin-5-amine
SMILES CN(c1cncnc1)c1cc(C)nc(OCc2cccc(Cl)c2)c1
InChI Key InChIKey=AMXQQNOPZVBITB-UHFFFAOYSA-N
Data  1 KI
  Tab Delimited (TSV)   2D SDfile   Computed 3D by Vconf -m prep SDfile
Find this compound or compounds like it in BindingDB:
Activity Spreadsheet -- Enzyme Inhibition Constant Data from BindingDB
Found 1 hit for monomerid = 50181079
TargetMetabotropic glutamate receptor 5(Homo sapiens (Human))
F. Hoffmann-La Roche
Curated by ChEMBL
LigandPNGBDBM50181079(CHEMBL207097 | N-(2-(3-chlorobenzyloxy)-6-methylpy...)
Affinity DataKi:  11nM. Assay description: Displacement of [3H]MPEP from recombinant human mGlu5 receptor
In DepthDetails ArticlePubMed