BDBM50184952 CHEMBL3823476
SMILES CN1CCN(CC1)c1ccc(cc1NC(=O)c1ccc(F)c(C)c1Cl)-c1ccccc1
InChI Key InChIKey=IJGXSYJCQSUICM-UHFFFAOYSA-N
Data  2 IC50
  Tab Delimited (TSV)   2D SDfile   Computed 3D by Vconf -m prep SDfile
Find this compound or compounds like it in BindingDB:
Activity Spreadsheet -- Enzyme Inhibition Constant Data from BindingDB
Found 2 hits for monomerid = 50184952
TargetWD repeat-containing protein 5(Homo sapiens (Human))
China Pharmaceutical University
Curated by ChEMBL
LigandPNGBDBM50184952(CHEMBL3823476)
Affinity DataIC50:  466nM. Assay description: Inhibition of 10mer-Thr-FAM probe binding to human WDR5 after 2 hrs by fluorescence polarization assay
In DepthDetails ArticlePubMed
TargetWD repeat-containing protein 5(Homo sapiens (Human))
China Pharmaceutical University
Curated by ChEMBL
LigandPNGBDBM50184952(CHEMBL3823476)
Affinity DataIC50:  466nM. Assay description: Inhibition of 10mer-Thr-FAM probe binding to His-tagged human WDR5 expressed in Escherichia coli incubated for 2 hrs by fluorescence polarization ass...
In DepthDetails ArticlePubMed