BDBM50185770 CHEMBL3822749
SMILES CC(C(=O)NCc1ccc(nc1N1CCC(C)CC1)C(F)(F)F)c1ccc(CNS(C)(=O)=O)c(F)c1
InChI Key InChIKey=ARMZBBXOPXFIEN-UHFFFAOYSA-N
Data  2 KI
  Tab Delimited (TSV)   2D SDfile   Computed 3D by Vconf -m prep SDfile
Find this compound or compounds like it in BindingDB:
Activity Spreadsheet -- Enzyme Inhibition Constant Data from BindingDB
Found 2 hits for monomerid = 50185770
TargetTransient receptor potential cation channel subfamily V member 1(Homo sapiens (Human))
Seoul National University
Curated by ChEMBL
LigandPNGBDBM50185770(CHEMBL3822749)
Affinity DataKi:  28nM. Assay description: Antagonist activity at human TRPV1 expressed in CHO cells assessed as inhibition of capsaicin-induced 45Ca2+ uptake incubated for 5 mins by liquid sc...
In DepthDetails ArticlePubMed
TargetTransient receptor potential cation channel subfamily V member 1(Homo sapiens (Human))
Seoul National University
Curated by ChEMBL
LigandPNGBDBM50185770(CHEMBL3822749)
Affinity DataKi:  230nM. Assay description: Displacement of [3H]-resiniferatoxin from human TRPV1 expressed in CHO cells incubated for 60 mins by scintillation counting analysis
In DepthDetails ArticlePubMed