BDBM50186048 CHEMBL212381::N-butyl-N-(5-(1,1,1,3,3,3-hexafluoro-2-hydroxypropan-2-yl)thiazol-2-yl)isobutyramide
SMILES CCCCN(C(=O)C(C)C)c1ncc(s1)C(O)(C(F)(F)F)C(F)(F)F
InChI Key InChIKey=NYZBEJJPKODUPY-UHFFFAOYSA-N
Data  1 IC50
  Tab Delimited (TSV)   2D SDfile   Computed 3D by Vconf -m prep SDfile
Find this compound or compounds like it in BindingDB:
Activity Spreadsheet -- Enzyme Inhibition Constant Data from BindingDB
Found 1 hit for monomerid = 50186048
TargetMalonyl-CoA decarboxylase, mitochondrial(Homo sapiens (Human))
Chugai Pharma
Curated by ChEMBL
LigandPNGBDBM50186048(CHEMBL212381 | N-butyl-N-(5-(1,1,1,3,3,3-hexafluor...)
Affinity DataIC50:  984nM. Assay description: Inhibition of MCD
In DepthDetails ArticlePubMed