BDBM50188294 (R)-4-methyl-2-[3'-(2-piperazin-1-ylmethyl-thiazol-4-yl)-biphenyl-3-yl]-pentanoic acid cyanomethyl-amide::CHEMBL213194
SMILES CC(C)C[C@@H](C(=O)NCC#N)c1cccc(c1)-c1cccc(c1)-c1csc(CN2CCNCC2)n1
InChI Key InChIKey=GGQXMEFMGFPZJK-RUZDIDTESA-N
Data  4 KI
  Tab Delimited (TSV)   2D SDfile   Computed 3D by Vconf -m prep SDfile
Find this compound or compounds like it in BindingDB:
Activity Spreadsheet -- Enzyme Inhibition Constant Data from BindingDB
Found 4 hits for monomerid = 50188294
TargetCathepsin K(Homo sapiens (Human))
Celera Genomics
Curated by ChEMBL
LigandPNGBDBM50188294((R)-4-methyl-2-[3'-(2-piperazin-1-ylmethyl-thiazol...)
Affinity DataKi:  4.80nM. Assay description: Inhibition of human cathepsin K
In DepthDetails ArticlePubMed
TargetProcathepsin L(Homo sapiens (Human))
Celera Genomics
Curated by ChEMBL
LigandPNGBDBM50188294((R)-4-methyl-2-[3'-(2-piperazin-1-ylmethyl-thiazol...)
Affinity DataKi:  680nM. Assay description: Inhibition of human cathepsin L
In DepthDetails ArticlePubMed
TargetCathepsin S(Homo sapiens (Human))
Celera Genomics
Curated by ChEMBL
LigandPNGBDBM50188294((R)-4-methyl-2-[3'-(2-piperazin-1-ylmethyl-thiazol...)
Affinity DataKi:  7.40E+3nM. Assay description: Inhibition of human cathepsin S
In DepthDetails ArticlePubMed
TargetCathepsin B(Homo sapiens (Human))
Celera Genomics
Curated by ChEMBL
LigandPNGBDBM50188294((R)-4-methyl-2-[3'-(2-piperazin-1-ylmethyl-thiazol...)
Affinity DataKi:  5.10E+4nM. Assay description: Inhibition of human cathepsin B
In DepthDetails ArticlePubMed