BDBM50189012 (S)-2-((R)-2-amino-3-(4-fluorophenyl)propanamido)-5-guanidino-N-((S)-1-(methylamino)-3-(naphthalen-2-yl)-1-oxopropan-2-yl)pentanamide::CHEMBL212332
SMILES [#6]-[#7]-[#6](=O)-[#6@H](-[#6]-c1ccc2ccccc2c1)-[#7]-[#6](=O)-[#6@H](-[#6]-[#6]-[#6]\[#7]=[#6](/[#7])-[#7])-[#7]-[#6](=O)-[#6@H](-[#7])-[#6]-c1ccc(F)cc1
InChI Key InChIKey=KLUZHUBQPREOSA-DSITVLBTSA-N
Data  3 KI  3 EC50
  Tab Delimited (TSV)   2D SDfile   Computed 3D by Vconf -m prep SDfile
Find this compound or compounds like it in BindingDB:
Activity Spreadsheet -- Enzyme Inhibition Constant Data from BindingDB
Found 6 hits for monomerid = 50189012
TargetMelanocortin receptor 4(Homo sapiens (Human))
Procter & Gamble Pharmaceuticals
Curated by ChEMBL
LigandPNGBDBM50189012((S)-2-((R)-2-amino-3-(4-fluorophenyl)propanamido)-...)
Affinity DataKi:  225nM. Assay description: Binding affinity to human MC4R
In DepthDetails ArticlePubMed
TargetMelanocortin receptor 3(Homo sapiens (Human))
Procter & Gamble Pharmaceuticals
Curated by ChEMBL
LigandPNGBDBM50189012((S)-2-((R)-2-amino-3-(4-fluorophenyl)propanamido)-...)
Affinity DataKi:  1.14E+3nM. Assay description: Binding affinity to human MC3R
In DepthDetails ArticlePubMed
TargetMelanocyte-stimulating hormone receptor(Homo sapiens (Human))
Procter & Gamble Pharmaceuticals
Curated by ChEMBL
LigandPNGBDBM50189012((S)-2-((R)-2-amino-3-(4-fluorophenyl)propanamido)-...)
Affinity DataKi:  4.06E+3nM. Assay description: Binding affinity to human MC1R
In DepthDetails ArticlePubMed
TargetMelanocortin receptor 4(Homo sapiens (Human))
Procter & Gamble Pharmaceuticals
Curated by ChEMBL
LigandPNGBDBM50189012((S)-2-((R)-2-amino-3-(4-fluorophenyl)propanamido)-...)
Affinity DataEC50:  140nM. Assay description: Agonist activity at human MC4R
In DepthDetails ArticlePubMed
TargetMelanocyte-stimulating hormone receptor(Homo sapiens (Human))
Procter & Gamble Pharmaceuticals
Curated by ChEMBL
LigandPNGBDBM50189012((S)-2-((R)-2-amino-3-(4-fluorophenyl)propanamido)-...)
Affinity DataEC50:  2.17E+4nM. Assay description: Agonist activity at human MC1R
In DepthDetails ArticlePubMed
TargetMelanocortin receptor 3(Homo sapiens (Human))
Procter & Gamble Pharmaceuticals
Curated by ChEMBL
LigandPNGBDBM50189012((S)-2-((R)-2-amino-3-(4-fluorophenyl)propanamido)-...)
Affinity DataEC50:  2.00E+4nM. Assay description: Agonist activity at human MC3R
In DepthDetails ArticlePubMed