BDBM50191845 5-(4-chlorophenyl)-4-(4-(4-methyl-1H-imidazol-5-yl)piperidin-1-yl)pyrimidine::CHEMBL425073
SMILES Cc1nc[nH]c1C1CCN(CC1)c1ncncc1-c1ccc(Cl)cc1
InChI Key InChIKey=XVOUKEXUZILDIB-UHFFFAOYSA-N
Data  1 IC50
  Tab Delimited (TSV)   2D SDfile   Computed 3D by Vconf -m prep SDfile
Find this compound or compounds like it in BindingDB:
Activity Spreadsheet -- Enzyme Inhibition Constant Data from BindingDB
Found 1 hit for monomerid = 50191845
TargetSodium/hydrogen exchanger 1(Homo sapiens (Human))
Pharmaceutical Research Institute
Curated by ChEMBL
LigandPNGBDBM50191845(5-(4-chlorophenyl)-4-(4-(4-methyl-1H-imidazol-5-yl...)
Affinity DataIC50:  350nM. Assay description: Inhibition of human NHE1 expressed in Ap1 cell line
In DepthDetails ArticlePubMed