BDBM50192197 2-chloro-N-(4-(5-(1-methylcyclopropanecarboxamido)-1H-benzo[d]imidazol-2-yl)phenyl)benzamide::CHEMBL385936
SMILES CC1(CC1)C(=O)Nc1ccc2nc([nH]c2c1)-c1ccc(NC(=O)c2ccccc2Cl)cc1
InChI Key InChIKey=LBRNGTYCTDCBDI-UHFFFAOYSA-N
Data  2 EC50
  Tab Delimited (TSV)   2D SDfile   Computed 3D by Vconf -m prep SDfile
Find this compound or compounds like it in BindingDB:
Activity Spreadsheet -- Enzyme Inhibition Constant Data from BindingDB
Found 2 hits for monomerid = 50192197
TargetPhotoreceptor-specific nuclear receptor(Homo sapiens (Human))
Merck
Curated by ChEMBL
LigandPNGBDBM50192197(2-chloro-N-(4-(5-(1-methylcyclopropanecarboxamido)...)
Affinity DataEC50:  2.90E+3nM. Assay description: Agonist activity at NR2E3 by luciferase NCOR release assay in CHO cells
In DepthDetails ArticlePubMed
TargetPhotoreceptor-specific nuclear receptor(Homo sapiens (Human))
Merck
Curated by ChEMBL
LigandPNGBDBM50192197(2-chloro-N-(4-(5-(1-methylcyclopropanecarboxamido)...)
Affinity DataEC50:  2.50E+3nM. Assay description: Agonist activity at NR2E3 by beta lactamase transactivation assay
In DepthDetails ArticlePubMed