BDBM50196886 CHEMBL3969544
SMILES Cl.CC(C)CC(=O)c1c(O)cc(O)cc1OC[C@H](O)CNC(C)(C)C
InChI Key InChIKey=MAITWYBHLXVDNP-BTQNPOSSSA-N
Data  1 IC50
  Tab Delimited (TSV)   2D SDfile   Computed 3D by Vconf -m prep SDfile
Find this compound or compounds like it in BindingDB:
Activity Spreadsheet -- Enzyme Inhibition Constant Data from BindingDB
Found 1 hit for monomerid = 50196886
TargetProto-oncogene tyrosine-protein kinase Src(Mus musculus (Mouse))
Chinese Academy Of Medical Sciences And Peking Union Medical College
Curated by ChEMBL
LigandPNGBDBM50196886(CHEMBL3969544)
Affinity DataIC50:  3.73E+4nM. Assay description: Inhibition of Src in mouse BV2 cells assessed as suppression of LPS-induced NO release preincubated for 1 hr followed by LPS addition measured after ...
In DepthDetails ArticlePubMed