BDBM50198897 CHEMBL568596
SMILES N=C1NC(=O)\C(S1)=C\c1ccccc1
InChI Key InChIKey=SRILECHSVYTLLS-VURMDHGXSA-N
Data  1 KI  1 IC50
  Tab Delimited (TSV)   2D SDfile   Computed 3D by Vconf -m prep SDfile
Find this compound or compounds like it in BindingDB:
Activity Spreadsheet -- Enzyme Inhibition Constant Data from BindingDB
Found 2 hits for monomerid = 50198897
TargetCDGSH iron-sulfur domain-containing protein 1(Homo sapiens (Human))
West Virginia University
Curated by ChEMBL
LigandPNGBDBM50198897(CHEMBL568596)
Affinity DataKi:  1.59E+6nM. Assay description: Displacement of [3H]rosiglitazone from recombinant human C-terminal His-tagged MitoNEET cytosolic domain (32 to 108 residues) expressed in Escherichi...
In DepthDetails ArticlePubMed
TargetCDGSH iron-sulfur domain-containing protein 1(Homo sapiens (Human))
West Virginia University
Curated by ChEMBL
LigandPNGBDBM50198897(CHEMBL568596)
Affinity DataIC50:  3.73E+7nM. Assay description: Displacement of [3H]rosiglitazone from recombinant human C-terminal His-tagged MitoNEET cytosolic domain (32 to 108 residues) expressed in Escherichi...
In DepthDetails ArticlePubMed