BDBM50199010 4-chloro-N-[2-(2-chlorophenyl)-5-hydroxy-4-oxo-4H-chromen-8-yl]benzamide::CHEMBL223547
SMILES Oc1ccc(NC(=O)c2ccc(Cl)cc2)c2oc(cc(=O)c12)-c1ccccc1Cl
InChI Key InChIKey=ZKFFLIQZUSVOLA-UHFFFAOYSA-N
Data  1 IC50
  Tab Delimited (TSV)   2D SDfile   Computed 3D by Vconf -m prep SDfile
Find this compound or compounds like it in BindingDB:
Activity Spreadsheet -- Enzyme Inhibition Constant Data from BindingDB
Found 1 hit for monomerid = 50199010
TargetCyclin-A1/Cyclin-A2/Cyclin-dependent kinase 2(Homo sapiens (Human))
University Of Kansas
Curated by ChEMBL
LigandPNGBDBM50199010(4-chloro-N-[2-(2-chlorophenyl)-5-hydroxy-4-oxo-4H-...)
Affinity DataIC50:  4.17E+5nM. Assay description: Inhibition of CDK2/Cyclin A
In DepthDetails ArticlePubMed