BDBM50199226 6-(4-fluorophenyl)-3-[2-(4-morpholinylmethyl)-6-quinolinyl]-thieno[3,2-d]pyrimidin-4(3H)-one::CHEMBL384805
SMILES Fc1ccc(cc1)-c1cc2ncn(-c3ccc4nc(CN5CCOCC5)ccc4c3)c(=O)c2s1
InChI Key InChIKey=VDCOSOIAYQFECH-UHFFFAOYSA-N
Data  1 IC50
  Tab Delimited (TSV)   2D SDfile   Computed 3D by Vconf -m prep SDfile
Find this compound or compounds like it in BindingDB:
Activity Spreadsheet -- Enzyme Inhibition Constant Data from BindingDB
Found 1 hit for monomerid = 50199226
TargetMelanin-concentrating hormone receptor 1(Homo sapiens (Human))
Glaxosmithkline
Curated by ChEMBL
LigandPNGBDBM50199226(6-(4-fluorophenyl)-3-[2-(4-morpholinylmethyl)-6-qu...)
Affinity DataIC50:  501nM. Assay description: Antagonist activity against human MCHR1 expressed in CHO cells by Gal4/Elk1-Luc reporter assay
In DepthDetails ArticlePubMed