BDBM50202645 CHEMBL3948512::US10730889, Example 228::US11485745, Example 228
SMILES CC1(CCC1)OC(=O)N1CCC2(CC2CNC(=O)N2Cc3ccncc3C2)CC1
InChI Key InChIKey=JXAXUBCGFYHKMH-UHFFFAOYSA-N
Data  5 IC50
  Tab Delimited (TSV)   2D SDfile   Computed 3D by Vconf -m prep SDfile
Find this compound or compounds like it in BindingDB:
Activity Spreadsheet -- Enzyme Inhibition Constant Data from BindingDB
Found 5 hits for monomerid = 50202645
TargetNicotinamide phosphoribosyltransferase(Homo sapiens (Human))
Genentech
Curated by ChEMBL
LigandPNGBDBM50202645(CHEMBL3948512 | US10730889, Example 228 | US114857...)
Affinity DataIC50:  22nM. Assay description: Inhibition of human full length C-terminal His6-tagged NAMPT expressed in Escherichia coli Rosetta (DE3) cells using nicotinamide as substrate incuba...
In DepthDetails ArticlePubMed
TargetNicotinamide phosphoribosyltransferase(Homo sapiens (Human))
Genentech
Curated by ChEMBL
LigandPNGBDBM50202645(CHEMBL3948512 | US10730889, Example 228 | US114857...)
Affinity DataIC50:  4.80nM. Assay description: Inhibition of NAMPT in human A2780 cells assessed as decrease in cell viability after 72 hrs by SRB assay
In DepthDetails ArticlePubMed
TargetNicotinamide phosphoribosyltransferase(Homo sapiens (Human))
Genentech
Curated by ChEMBL
LigandPNGBDBM50202645(CHEMBL3948512 | US10730889, Example 228 | US114857...)
Affinity DataIC50:  22.2nM. Assay description: The NAMPT enzymatic reactions were carried out in Buffer A (50 mM Hepes pH 17.5, 50 mM NaCl, 5 mM MgCl2, and 1 mM THP) in 96-well V-bottom plates. Th...
In DepthDetails US Patent
TargetNicotinamide phosphoribosyltransferase(Homo sapiens (Human))
Genentech
Curated by ChEMBL
LigandPNGBDBM50202645(CHEMBL3948512 | US10730889, Example 228 | US114857...)
Affinity DataIC50:  22.2nM. Assay description: NAMPT Protein Purification. Recombinant His-tagged NAMPT was produced in E. coli cells, purified over a Ni column, and further purified over a size-e...
In DepthDetails US Patent
TargetCytochrome P450 2C9(Homo sapiens (Human))
Genentech
Curated by ChEMBL
LigandPNGBDBM50202645(CHEMBL3948512 | US10730889, Example 228 | US114857...)
Affinity DataIC50: >1.00E+4nM. Assay description: Reversible inhibition of CYP2C9 in human liver microsomes using (S)-warfarin as substrate in presence of NADPH by LC-MS/MS analysis
In DepthDetails ArticlePubMed