BDBM50204974 3-{4-[5-[2-(N'-benzoyl-hydrazino)-2-oxo-ethylsulfanyl]-4-(4-chloro-benzoylamino)-4H-[1,2,4]triazol-3-ylmethyl]-thiazol-2-ylamino}-propionic acid::CHEMBL231867
SMILES OC(=O)CCNc1nc(Cc2nnc(SCC(=O)NNC(=O)c3ccccc3)n2NC(=O)c2ccc(Cl)cc2)cs1
InChI Key InChIKey=VTYYVCJXEXLKJR-UHFFFAOYSA-N
Data  1 IC50
  Tab Delimited (TSV)   2D SDfile   Computed 3D by Vconf -m prep SDfile
Find this compound or compounds like it in BindingDB:
Activity Spreadsheet -- Enzyme Inhibition Constant Data from BindingDB
Found 1 hit for monomerid = 50204974
TargetCyclin-dependent kinase 5 activator 1(Homo sapiens (Human))
Dr. Reddys Laboratories
Curated by ChEMBL
LigandPNGBDBM50204974(3-{4-[5-[2-(N'-benzoyl-hydrazino)-2-oxo-ethylsulfa...)
Affinity DataIC50:  268nM. Assay description: Inhibition of human cdk5/p25 by SPA
In DepthDetails ArticlePubMed