BDBM50208147 CHEMBL3949142
SMILES OC(=O)C1CC11CCC2(CCN(CC2)c2cc(OC(F)(F)F)ccc2Cl)CC1
InChI Key InChIKey=URKADBGRJJNSAM-UHFFFAOYSA-N
Data  2 EC50
  Tab Delimited (TSV)   2D SDfile   Computed 3D by Vconf -m prep SDfile
Find this compound or compounds like it in BindingDB:
Activity Spreadsheet -- Enzyme Inhibition Constant Data from BindingDB
Found 2 hits for monomerid = 50208147
TargetFree fatty acid receptor 4(Homo sapiens (Human))
Merck
Curated by ChEMBL
LigandPNGBDBM50208147(CHEMBL3949142)
Affinity DataEC50:  2.20E+3nM. Assay description: Agonist activity at human GPR120 short isoform expressed in CHOK1 cells assessed as induction of IP1 accumulation after 60 mins by HTRF assay
In DepthDetails ArticlePubMed
TargetFree fatty acid receptor 4(Homo sapiens (Human))
Merck
Curated by ChEMBL
LigandPNGBDBM50208147(CHEMBL3949142)
Affinity DataEC50:  3.90E+3nM. Assay description: Agonist activity at ARMS2-PK2 -tagged human GPR120 short isoform expressed in CHOK1 cells assessed as induction of beta-arrestin2 recruitment after 9...
In DepthDetails ArticlePubMed