BDBM50209162 2-(4-methyl-piperazin-1-yl)-N-(3-thiophen-3-yl-2,4-dihydro-indeno[1,2-c]pyrazol-5-yl)-acetamide::CHEMBL245768
SMILES CN1CCN(CC(=O)Nc2cccc-3c2Cc2c-3n[nH]c2-c2ccsc2)CC1
InChI Key InChIKey=DQXRNJOFIYWUBI-UHFFFAOYSA-N
Data  3 IC50
  Tab Delimited (TSV)   2D SDfile   Computed 3D by Vconf -m prep SDfile
Find this compound or compounds like it in BindingDB:
Activity Spreadsheet -- Enzyme Inhibition Constant Data from BindingDB
Found 3 hits for monomerid = 50209162
TargetVascular endothelial growth factor receptor 2(Homo sapiens (Human))
Abbott Laboratories
Curated by ChEMBL
LigandPNGBDBM50209162(2-(4-methyl-piperazin-1-yl)-N-(3-thiophen-3-yl-2,4...)
Affinity DataIC50:  920nM. Assay description: Inhibition of KDR by HTRF assay
In DepthDetails ArticlePubMed
TargetMast/stem cell growth factor receptor Kit(Homo sapiens (Human))
Abbott Laboratories
Curated by ChEMBL
LigandPNGBDBM50209162(2-(4-methyl-piperazin-1-yl)-N-(3-thiophen-3-yl-2,4...)
Affinity DataIC50:  4.33E+3nM. Assay description: Inhibition of c-Kit by HTRF assay
In DepthDetails ArticlePubMed
TargetVascular endothelial growth factor receptor 1(Homo sapiens (Human))
Abbott Laboratories
Curated by ChEMBL
LigandPNGBDBM50209162(2-(4-methyl-piperazin-1-yl)-N-(3-thiophen-3-yl-2,4...)
Affinity DataIC50:  710nM. Assay description: Inhibition of Flt1 by HTRF assay
In DepthDetails ArticlePubMed