BDBM50214682 1-{4-[(1S)-2-(1-amino-3-methylbutyl)-4-trifluoromethylphenyl]-4-[(2R)-(piperidin-4-ylcarboxamido)-3-(2,4-dichlorophenyl)propionyl]}-piperazine::CHEMBL235190
SMILES CC(C)C[C@H](N)c1cc(ccc1N1CCN(CC1)C(=O)[C@@H](Cc1ccc(Cl)cc1Cl)NC(=O)C1CCNCC1)C(F)(F)F
InChI Key InChIKey=QOBFFKATRNHSSE-RRPNLBNLSA-N
Data  1 KI
  Tab Delimited (TSV)   2D SDfile   Computed 3D by Vconf -m prep SDfile
Find this compound or compounds like it in BindingDB:
Activity Spreadsheet -- Enzyme Inhibition Constant Data from BindingDB
Found 1 hit for monomerid = 50214682
TargetMelanocortin receptor 4(Homo sapiens (Human))
Neurocrine Biosciences
Curated by ChEMBL
LigandPNGBDBM50214682(1-{4-[(1S)-2-(1-amino-3-methylbutyl)-4-trifluorome...)
Affinity DataKi:  0.800nM. Assay description: Displacement of [125I]NDP-MSH from MC4R receptor in HEK293 cells
In DepthDetails ArticlePubMed