BDBM50219012 CHEMBL359035
SMILES COc1ncc(C(=O)Nc2c(Cl)c[n+]([O-])cc2Cl)c2cc(oc12)C1(CCN(CC1)C(=O)OC(C)(C)C)OC
InChI Key InChIKey=LYJGBGQLQMRKKF-UHFFFAOYSA-N
Data  2 IC50
  Tab Delimited (TSV)   2D SDfile   Computed 3D by Vconf -m prep SDfile
Find this compound or compounds like it in BindingDB:
Activity Spreadsheet -- Enzyme Inhibition Constant Data from BindingDB
Found 2 hits for monomerid = 50219012
TargetcAMP-specific 3',5'-cyclic phosphodiesterase 4C(Rattus norvegicus)
Celltech R&D
Curated by ChEMBL
LigandPNGBDBM50219012(CHEMBL359035)
Affinity DataIC50:  1.01E+3nM. Assay description: Inhibition of rolipram binding to rat brain
In DepthDetails ArticlePubMed
TargetcAMP-specific 3',5'-cyclic phosphodiesterase 4A/4B/4C/4D(Homo sapiens (Human))
Celltech R&D
Curated by ChEMBL
LigandPNGBDBM50219012(CHEMBL359035)
Affinity DataIC50:  48nM. Assay description: Inhibition of human phosphodiesterase 4 from U937 cells
In DepthDetails ArticlePubMed