BDBM50219744 2-(3-(morpholinosulfonyl)benzamido)benzoic acid::CHEMBL249879
SMILES OC(=O)c1ccccc1NC(=O)c1cccc(c1)S(=O)(=O)N1CCOCC1
InChI Key InChIKey=NJZDOFVELZGWJL-UHFFFAOYSA-N
Data  1 Kd
  Tab Delimited (TSV)   2D SDfile   Computed 3D by Vconf -m prep SDfile
Find this compound or compounds like it in BindingDB:
Activity Spreadsheet -- Enzyme Inhibition Constant Data from BindingDB
Found 1 hit for monomerid = 50219744
TargetAlbumin(Homo sapiens (Human))
Pharmacia
Curated by ChEMBL
LigandPNGBDBM50219744(2-(3-(morpholinosulfonyl)benzamido)benzoic acid | ...)
Affinity DataKd:  6.00E+3nM. Assay description: Displacement of fluorescent dansyl sarcosine from human serum albumin site II on subdomain IIIA
In DepthDetails ArticlePubMed