BDBM50221275 4-(4,5-dihydro-5-thioxo-1,3,4-thiadiazol-2-yl)-1-(2-oxoindolin-3-ylidene)semicarbazide::CHEMBL392816
SMILES Sc1nnc(NC(=O)NN=C2C(=O)Nc3ccccc23)s1
InChI Key InChIKey=RNMWXHQLUATZEX-UHFFFAOYSA-N
Data  3 KI
  Tab Delimited (TSV)   2D SDfile   Computed 3D by Vconf -m prep SDfile
Find this compound or compounds like it in BindingDB:
Activity Spreadsheet -- Enzyme Inhibition Constant Data from BindingDB
Found 3 hits for monomerid = 50221275
TargetCarbonic anhydrase 1(Homo sapiens (Human))
Assiut University
Curated by ChEMBL
LigandPNGBDBM50221275(4-(4,5-dihydro-5-thioxo-1,3,4-thiadiazol-2-yl)-1-(...)
Affinity DataKi:  7.89E+3nM. Assay description: Inhibition of human cloned carbonic anhydrase1 by CO2 hydration method
In DepthDetails ArticlePubMed
TargetCarbonic anhydrase 2(Homo sapiens (Human))
Assiut University
Curated by ChEMBL
LigandPNGBDBM50221275(4-(4,5-dihydro-5-thioxo-1,3,4-thiadiazol-2-yl)-1-(...)
Affinity DataKi:  8.36E+3nM. Assay description: Inhibition of human cloned carbonic anhydrase2 by CO2 hydration method
In DepthDetails ArticlePubMed
TargetCarbonic anhydrase 9(Homo sapiens (Human))
Assiut University
Curated by ChEMBL
LigandPNGBDBM50221275(4-(4,5-dihydro-5-thioxo-1,3,4-thiadiazol-2-yl)-1-(...)
Affinity DataKi:  9.40E+3nM. Assay description: Inhibition of catalytic domain of human cloned carbonic anhydrase9 by CO2 hydration method
In DepthDetails ArticlePubMed