BDBM50222309 6,7-dihydroxy-4'-methoxyisoflavanone::CHEMBL239031
SMILES COc1ccc(cc1)C1COc2cc(O)c(O)cc2C1=O
InChI Key InChIKey=PZSNGTWDLWGBMP-UHFFFAOYSA-N
Data  3 IC50
  Tab Delimited (TSV)   2D SDfile   Computed 3D by Vconf -m prep SDfile
Find this compound or compounds like it in BindingDB:
Activity Spreadsheet -- Enzyme Inhibition Constant Data from BindingDB
Found 3 hits for monomerid = 50222309
TargetPolyunsaturated fatty acid lipoxygenase ALOX15B(Homo sapiens (Human))
Universidad De Santiago De Chile
Curated by ChEMBL
LigandPNGBDBM50222309(6,7-dihydroxy-4'-methoxyisoflavanone | CHEMBL23903...)
Affinity DataIC50: >1.00E+5nM. Assay description: Inhibition of 15-hLO2
In DepthDetails ArticlePubMed
TargetPolyunsaturated fatty acid lipoxygenase ALOX15(Homo sapiens (Human))
Universidad De Santiago De Chile
Curated by ChEMBL
LigandPNGBDBM50222309(6,7-dihydroxy-4'-methoxyisoflavanone | CHEMBL23903...)
Affinity DataIC50:  1.90E+4nM. Assay description: Inhibition of 15-hLO1
In DepthDetails ArticlePubMed
TargetPolyunsaturated fatty acid lipoxygenase ALOX12(Homo sapiens (Human))
Universidad De Santiago De Chile
Curated by ChEMBL
LigandPNGBDBM50222309(6,7-dihydroxy-4'-methoxyisoflavanone | CHEMBL23903...)
Affinity DataIC50:  1.60E+3nM. Assay description: Inhibition of 12-hLO
In DepthDetails ArticlePubMed