BDBM50223906 LUOTONIN A
SMILES O=c1n2Cc3cc4ccccc4nc3-c2nc2ccccc12
InChI Key InChIKey=LUMDXNLBIYLTER-UHFFFAOYSA-N
Data  2 IC50
  Tab Delimited (TSV)   2D SDfile   Computed 3D by Vconf -m prep SDfile
Find this compound or compounds like it in BindingDB:
Activity Spreadsheet -- Enzyme Inhibition Constant Data from BindingDB
Found 2 hits for monomerid = 50223906
TargetHistone deacetylase (HDAC1 and HDAC2)(Homo sapiens (Human))
Csir-Indian Institute Of Chemical Technology
Curated by ChEMBL
LigandPNGBDBM50223906(LUOTONIN A)
Affinity DataIC50:  6.40E+3nM. Assay description: Inhibition of HDAC1/2 in human HeLa cells using color de lys as substrate after 30 mins by colorimetric analysis
In DepthDetails ArticlePubMed
TargetDNA topoisomerase 2-alpha/2-beta(Homo sapiens (Human))
Toho University
Curated by ChEMBL
LigandPNGBDBM50223906(LUOTONIN A)
Affinity DataIC50:  2.85E+4nM. Assay description: Inhibitory activity against human DNA topoisomerase II
In DepthDetails ArticlePubMed