BDBM50225808 3-[4-oxo-8-(1-oxo-1lambda4-thiomorpholin-4-yl)-7-phenylethynyl-4,5-dihydro-3H-benzo[b][1,4]diazepin-2-yl]-benzonitrile::CHEMBL236668
SMILES O=C1CC(=Nc2cc(N3CCS(=O)CC3)c(cc2N1)C#Cc1ccccc1)c1cccc(c1)C#N
InChI Key InChIKey=XTRSRHZIKGNVHK-UHFFFAOYSA-N
Data  1 IC50
  Tab Delimited (TSV)   2D SDfile   Computed 3D by Vconf -m prep SDfile
Find this compound or compounds like it in BindingDB:
Activity Spreadsheet -- Enzyme Inhibition Constant Data from BindingDB
Found 1 hit for monomerid = 50225808
TargetMetabotropic glutamate receptor 2(Homo sapiens (Human))
F. Hoffmann-La Roche
Curated by ChEMBL
LigandPNGBDBM50225808(3-[4-oxo-8-(1-oxo-1lambda4-thiomorpholin-4-yl)-7-p...)
Affinity DataIC50:  446nM. Assay description: Displacement of [3H]LY354740 from rat mGluR2 expressed in CHO cells
In DepthDetails ArticlePubMed