BDBM50226955 CHEMBL37352
SMILES C1CN=C(N1)C1CCc2ccccc2N1
InChI Key InChIKey=MPFHOEULCOMFLG-UHFFFAOYSA-N
Data  1 KI
  Tab Delimited (TSV)   2D SDfile   Computed 3D by Vconf -m prep SDfile
Find this compound or compounds like it in BindingDB:
Activity Spreadsheet -- Enzyme Inhibition Constant Data from BindingDB
Found 1 hit for monomerid = 50226955
LigandPNGBDBM50226955(CHEMBL37352)
Affinity DataKi:  14nM. Assay description: Binding affinity against alpha-2 adrenergic receptor was determined by the displacement of [3H]clonidine from rat brain cortical membranes
In DepthDetails ArticlePubMed