BDBM50227945 9-[[(4-chloro)phenyl]amino]-2-(methylthio)thiazolo[5,4-b]quinoline::CHEMBL270218::N-(4-chlorophenyl)-2-(methylthio)thiazolo[5,4-b]quinolin-9-amine
SMILES CSc1nc2c(Nc3ccc(Cl)cc3)c3ccccc3nc2s1
InChI Key InChIKey=MTGZXTJXMICTLQ-UHFFFAOYSA-N
Data  1 IC50
  Tab Delimited (TSV)   2D SDfile   Computed 3D by Vconf -m prep SDfile
Find this compound or compounds like it in BindingDB:
Activity Spreadsheet -- Enzyme Inhibition Constant Data from BindingDB
Found 1 hit for monomerid = 50227945
TargetDNA topoisomerase 2-alpha(Homo sapiens (Human))
Universidad Nacional AutóNoma De MéXico
Curated by ChEMBL
LigandPNGBDBM50227945(9-[[(4-chloro)phenyl]amino]-2-(methylthio)thiazolo...)
Affinity DataIC50:  2.05E+4nM. Assay description: Inhibition of human DNA topoisomerase 2-mediated Crithidia fasciculata kDNA decatenation using ethidium bromide staining by agarose gel electrophores...
In DepthDetails ArticlePubMed