BDBM50229723 CHEMBL4089144
SMILES COc1cc(cc(OC)c1OC)C1CC(=NN1C(C)=O)c1ccc(Nc2nc(nc(n2)N2CCCCC2)N2CCCCC2)cc1
InChI Key InChIKey=DUXASHYYDGYHKQ-UHFFFAOYSA-N
Data  2 IC50
  Tab Delimited (TSV)   2D SDfile   Computed 3D by Vconf -m prep SDfile
Find this compound or compounds like it in BindingDB:
Activity Spreadsheet -- Enzyme Inhibition Constant Data from BindingDB
Found 2 hits for monomerid = 50229723
TargetProstaglandin G/H synthase 1(Ovis aries (Sheep))
Beni-Suef University
Curated by ChEMBL
LigandPNGBDBM50229723(CHEMBL4089144)
Affinity DataIC50:  3.52E+3nM. Assay description: Inhibition of ovine COX1 using arachidonic acid as substrate preincubated for 5 mins followed by substrate addition measured after 2 mins by enzyme i...
In DepthDetails ArticlePubMed
TargetProstaglandin G/H synthase 2(Homo sapiens (Human))
Beni-Suef University
Curated by ChEMBL
LigandPNGBDBM50229723(CHEMBL4089144)
Affinity DataIC50:  690nM. Assay description: Inhibition of human COX2 using arachidonic acid as substrate preincubated for 5 mins followed by substrate addition measured after 2 mins by enzyme i...
In DepthDetails ArticlePubMed