BDBM50230354 CHEMBL4084694
SMILES [O-][N+](=O)c1ccc(cc1)C(=O)C(=S)N1CCOCC1
InChI Key InChIKey=MWOIENLQRWUAHG-UHFFFAOYSA-N
Data  5 IC50
  Tab Delimited (TSV)   2D SDfile   Computed 3D by Vconf -m prep SDfile
Find this compound or compounds like it in BindingDB:
Activity Spreadsheet -- Enzyme Inhibition Constant Data from BindingDB
Found 5 hits for monomerid = 50230354
TargetD-3-phosphoglycerate dehydrogenase(Homo sapiens (Human))
Universit£
Curated by ChEMBL
LigandPNGBDBM50230354(CHEMBL4084694)
Affinity DataIC50:  2.28E+4nM. Assay description: Inhibition of PHGDH in human SiHa cells assessed as reduction in cell viability in serine repleted medium after 5 days by presto blue assay
In DepthDetails ArticlePubMed
TargetD-3-phosphoglycerate dehydrogenase(Homo sapiens (Human))
Universit£
Curated by ChEMBL
LigandPNGBDBM50230354(CHEMBL4084694)
Affinity DataIC50:  7.60E+3nM. Assay description: Inhibition of PHGDH in human SiHa cells assessed as reduction in cell viability in serine depleted medium after 5 days by presto blue assay
In DepthDetails ArticlePubMed
TargetD-3-phosphoglycerate dehydrogenase(Homo sapiens (Human))
Universit£
Curated by ChEMBL
LigandPNGBDBM50230354(CHEMBL4084694)
Affinity DataIC50:  1.76E+4nM. Assay description: Inhibition of PHGDH in human HL60 cells assessed as reduction in cell viability in serine repleted medium after 5 days by presto blue assay
In DepthDetails ArticlePubMed
TargetD-3-phosphoglycerate dehydrogenase(Homo sapiens (Human))
Universit£
Curated by ChEMBL
LigandPNGBDBM50230354(CHEMBL4084694)
Affinity DataIC50:  6.00E+3nM. Assay description: Inhibition of PHGDH in human HL60 cells assessed as reduction in cell viability in serine depleted medium after 5 days by presto blue assay
In DepthDetails ArticlePubMed
TargetD-3-phosphoglycerate dehydrogenase(Homo sapiens (Human))
Universit£
Curated by ChEMBL
LigandPNGBDBM50230354(CHEMBL4084694)
Affinity DataIC50:  3.51E+4nM. Assay description: Inhibition of recombinant human C-terminal His-tagged PHGDH (1 to 533 residues) expressed in Escherichia coli assessed as reduction in NADH formation...
In DepthDetails ArticlePubMed