BDBM50234576 CHEMBL4083853
SMILES CN1CCN(Cc2ccc(NC(=O)c3ccc(C)c(c3)C#Cc3cncc(c3)N3CCN(C)CC3)cc2C(F)(F)F)CC1
InChI Key InChIKey=MXCIAIOVWVMWIF-UHFFFAOYSA-N
Data  2 IC50
  Tab Delimited (TSV)   2D SDfile   Computed 3D by Vconf -m prep SDfile
Find this compound or compounds like it in BindingDB:
Activity Spreadsheet -- Enzyme Inhibition Constant Data from BindingDB
Found 2 hits for monomerid = 50234576
TargetVascular endothelial growth factor receptor 2(Homo sapiens (Human))
Chinese Academy Of Sciences
Curated by ChEMBL
LigandPNGBDBM50234576(CHEMBL4083853)
Affinity DataIC50:  22nM. Assay description: Inhibition of recombinant KDR (unknown origin) using poly (Glu, Tyr) 4:1 after 60 mins by ELISA method
In DepthDetails ArticlePubMed
TargetFibroblast growth factor receptor 1(Homo sapiens (Human))
Chinese Academy Of Sciences
Curated by ChEMBL
LigandPNGBDBM50234576(CHEMBL4083853)
Affinity DataIC50:  5.70nM. Assay description: Inhibition of recombinant FGFR1 (unknown origin) using poly (Glu, Tyr) 4:1 after 60 mins by ELISA method
In DepthDetails ArticlePubMed