BDBM50237412 CHEMBL4090859
SMILES C1CCc2nc(SSc3nc4CCCCCc4s3)sc2CC1
InChI Key InChIKey=NXLFLCFGMLFSHH-UHFFFAOYSA-N
Data  1 KI  1 IC50
  Tab Delimited (TSV)   2D SDfile   Computed 3D by Vconf -m prep SDfile
Find this compound or compounds like it in BindingDB:
Activity Spreadsheet -- Enzyme Inhibition Constant Data from BindingDB
Found 2 hits for monomerid = 50237412
Target[Pyruvate dehydrogenase (acetyl-transferring)] kinase isozyme 1, mitochondrial(Homo sapiens (Human))
East China University Of Science And Technology
Curated by ChEMBL
LigandPNGBDBM50237412(CHEMBL4090859)
Affinity DataKi:  1.80E+3nM. Assay description: Inhibition of full length His6-tagged PDK1 (unknown origin) expressed in Escherichia coli using full length His6-tagged PDHA1 as substrate after 30 m...
In DepthDetails ArticlePubMed
Target[Pyruvate dehydrogenase (acetyl-transferring)] kinase isozyme 1, mitochondrial(Homo sapiens (Human))
East China University Of Science And Technology
Curated by ChEMBL
LigandPNGBDBM50237412(CHEMBL4090859)
Affinity DataIC50:  39nM. Assay description: Inhibition of full length His6-tagged PDK1 (unknown origin) expressed in Escherichia coli using full length His6-tagged PDHA1 as substrate after 30 m...
In DepthDetails ArticlePubMed