BDBM50241426 3-(2-hydroxyphenyl)-6-(3-nitrophenyl)-3,4-dihydropyrimidin-2(1H)-one::CHEMBL258405::Icilin::Icillin
SMILES Oc1ccccc1N1CC=C(NC1=O)c1cccc(c1)[N+]([O-])=O
InChI Key InChIKey=RCEFMOGVOYEGJN-UHFFFAOYSA-N
Data  1 IC50  6 EC50
PDB links: 5 PDB IDs match this monomer.
  Tab Delimited (TSV)   2D SDfile   Computed 3D by Vconf -m prep SDfile
Find this compound or compounds like it in BindingDB:
Activity Spreadsheet -- Enzyme Inhibition Constant Data from BindingDB
Found 7 hits for monomerid = 50241426
TargetTransient receptor potential cation channel subfamily M member 8(Rattus norvegicus (Rat))
National Research Council
Curated by ChEMBL
LigandPNGBDBM50241426(3-(2-hydroxyphenyl)-6-(3-nitrophenyl)-3,4-dihydrop...)
Affinity DataIC50:  58nM. Assay description: Antagonist activity against rat TRPM8 expressed in HEK293 cells assessed as inhibition of icilin-induced intracellular Ca2+ level pre-treated 5 mins ...
TargetTransient receptor potential cation channel subfamily M member 8(Rattus norvegicus (Rat))
National Research Council
Curated by ChEMBL
LigandPNGBDBM50241426(3-(2-hydroxyphenyl)-6-(3-nitrophenyl)-3,4-dihydrop...)
Affinity DataEC50:  110nM. Assay description: Agonist activity at rat TRPM8 expressed in HEK293 cells assessed as induction of intracellular Ca2+ level by Fluo-4-AM dye based spectrofluorimetry
TargetTransient receptor potential cation channel subfamily M member 8(Rattus norvegicus (Rat))
National Research Council
Curated by ChEMBL
LigandPNGBDBM50241426(3-(2-hydroxyphenyl)-6-(3-nitrophenyl)-3,4-dihydrop...)
Affinity DataEC50:  190nM. Assay description: Agonist activity at rat recombinant TRPM8 receptor expressed in HEK293 cells assessed as increase in intracellular calcium concentration by fluorimet...
LigandPNGBDBM50241426(3-(2-hydroxyphenyl)-6-(3-nitrophenyl)-3,4-dihydrop...)
Affinity DataEC50:  300nM. Assay description: Agonist activity at human recombinant TRPM8
TargetTransient receptor potential cation channel subfamily A member 1(Homo sapiens (Human))
Ferrara University
Curated by ChEMBL
LigandPNGBDBM50241426(3-(2-hydroxyphenyl)-6-(3-nitrophenyl)-3,4-dihydrop...)
Affinity DataEC50:  1.00E+5nM. Assay description: Agonist activity at human TRPA1 channel expressed in HEK293 cells assessed as increase in intracellular calcium influx
In DepthDetails ArticlePubMed
LigandPNGBDBM50241426(3-(2-hydroxyphenyl)-6-(3-nitrophenyl)-3,4-dihydrop...)
Affinity DataEC50:  60nM. Assay description: Activation of TRPM8 channel
LigandPNGBDBM50241426(3-(2-hydroxyphenyl)-6-(3-nitrophenyl)-3,4-dihydrop...)
Affinity DataEC50:  300nM. Assay description: Inhibition of human TRPM8 (unknown origin) expressed in HEK293 cells assessed as inhibition of WS12-induced Ca2+ elevation by FLIPR assay