BDBM50245320 (R)-2-[3-Amino-4-(2,4,5-trifluorophenyl)butyryl]-3,4-dihydro-2H-pyrazole-3-carboxylic acid amide HCl::CHEMBL511872
SMILES N[C@@H](CC(=O)N1N=CCC1C(N)=O)Cc1cc(F)c(F)cc1F
InChI Key InChIKey=WCQGCBAZRKARLN-SZSXPDSJSA-N
Data  1 IC50
  Tab Delimited (TSV)   2D SDfile   Computed 3D by Vconf -m prep SDfile
Find this compound or compounds like it in BindingDB:
Activity Spreadsheet -- Enzyme Inhibition Constant Data from BindingDB
Found 1 hit for monomerid = 50245320
TargetDipeptidyl peptidase 4(Homo sapiens (Human))
Korea Research Institute Of Chemical Technology
Curated by ChEMBL
LigandPNGBDBM50245320((R)-2-[3-Amino-4-(2,4,5-trifluorophenyl)butyryl]-3...)
Affinity DataIC50:  5.60E+3nM. Assay description: Inhibition of DPP4 in human Caco2 cells after 60 mins by fluorometry assay
In DepthDetails ArticlePubMed