BDBM50245465 5-(4-Chlorophenyl)-4-(4-methoxyphenyl)-1,2-selenazole::CHEMBL471331
SMILES COc1ccc(cc1)-c1cn[se]c1-c1ccc(Cl)cc1
InChI Key InChIKey=MVIRVXIGHRLVRN-UHFFFAOYSA-N
Data  1 IC50
  Tab Delimited (TSV)   2D SDfile   Computed 3D by Vconf -m prep SDfile
Find this compound or compounds like it in BindingDB:
Activity Spreadsheet -- Enzyme Inhibition Constant Data from BindingDB
Found 1 hit for monomerid = 50245465
TargetProstaglandin G/H synthase 1(Bos taurus)
Johannes Gutenberg University
Curated by ChEMBL
LigandPNGBDBM50245465(5-(4-Chlorophenyl)-4-(4-methoxyphenyl)-1,2-selenaz...)
Affinity DataIC50:  10nM. Assay description: Inhibition of bovine COX1
In DepthDetails ArticlePubMed