BDBM50254746 CHEMBL446879::N8-((2S,3R)-4-(cyclopropylamino)-3-hydroxy-1-phenylbutan-2-yl)-N6-((R)-1-(4-fluorophenyl)ethyl)-2,3,4,5-tetrahydrobenzo[b]oxepine-6,8-dicarboxamide
SMILES C[C@@H](NC(=O)c1cc(cc2OCCCCc12)C(=O)N[C@@H](Cc1ccccc1)[C@H](O)CNC1CC1)c1ccc(F)cc1
InChI Key InChIKey=WCHANTAGLXCTLE-HAQLSYKPSA-N
Data  2 IC50
  Tab Delimited (TSV)   2D SDfile   Computed 3D by Vconf -m prep SDfile
Find this compound or compounds like it in BindingDB:
Activity Spreadsheet -- Enzyme Inhibition Constant Data from BindingDB
Found 2 hits for monomerid = 50254746
TargetBeta-secretase 2(Homo sapiens (Human))
University Of Illinois At Chicago
Curated by ChEMBL
LigandPNGBDBM50254746(CHEMBL446879 | N8-((2S,3R)-4-(cyclopropylamino)-3-...)
Affinity DataIC50:  1.95E+3nM. Assay description: Inhibition of BACE2 expressed in human 293T cells
In DepthDetails ArticlePubMed
TargetBeta-secretase 1(Homo sapiens (Human))
University Of Illinois At Chicago
Curated by ChEMBL
LigandPNGBDBM50254746(CHEMBL446879 | N8-((2S,3R)-4-(cyclopropylamino)-3-...)
Affinity DataIC50:  262nM. Assay description: Inhibition of BACE1 (unknown origin) expressed in human 293T cells
In DepthDetails ArticlePubMed