BDBM50255388 CHEMBL4093492
SMILES N[C@@H](CCP(O)(=O)C(O)c1cccc(c1)[N+]([O-])=O)C(O)=O
InChI Key InChIKey=CAYKXAFYYYAPJS-FTNKSUMCSA-N
Data  6 EC50
  Tab Delimited (TSV)   2D SDfile   Computed 3D by Vconf -m prep SDfile
Find this compound or compounds like it in BindingDB:
Activity Spreadsheet -- Enzyme Inhibition Constant Data from BindingDB
Found 6 hits for monomerid = 50255388
TargetMetabotropic glutamate receptor 8(Homo sapiens (Human))
University of Paris
Curated by ChEMBL
LigandPNGBDBM50255388(CHEMBL4093492)
Affinity DataEC50:  1.20E+3nM. Assay description: Agonist activity at mGlu8 (unknown origin) expressed in HEK293 cells coexpressing chimeric Gq/i protein assessed as increase in intracellular calcium...
In DepthDetails ArticlePubMed
TargetMetabotropic glutamate receptor 6(Homo sapiens (Human))
University of Paris
Curated by ChEMBL
LigandPNGBDBM50255388(CHEMBL4093492)
Affinity DataEC50:  8.80E+3nM. Assay description: Agonist activity at mGlu6 (unknown origin) expressed in HEK293 cells coexpressing chimeric Gq/i protein assessed as [3H]inositol phosphate accumulati...
In DepthDetails ArticlePubMed
TargetMetabotropic glutamate receptor 4(Homo sapiens (Human))
University of Paris
Curated by ChEMBL
LigandPNGBDBM50255388(CHEMBL4093492)
Affinity DataEC50:  540nM. Assay description: Agonist activity at mGlu7 (unknown origin) expressed in HEK293 cells coexpressing chimeric Gq/i protein assessed as increase in intracellular calcium...
In DepthDetails ArticlePubMed
TargetMetabotropic glutamate receptor 4(Homo sapiens (Human))
University of Paris
Curated by ChEMBL
LigandPNGBDBM50255388(CHEMBL4093492)
Affinity DataEC50:  600nM. Assay description: Agonist activity at mGlu4 (unknown origin) expressed in HEK293 cells coexpressing chimeric Gq/i protein assessed as increase in intracellular calcium...
In DepthDetails ArticlePubMed
TargetMetabotropic glutamate receptor 8(Homo sapiens (Human))
University of Paris
Curated by ChEMBL
LigandPNGBDBM50255388(CHEMBL4093492)
Affinity DataEC50:  1.50E+3nM. Assay description: Agonist activity at mGlu8 (unknown origin) expressed in HEK293 cells coexpressing chimeric Gq/i protein assessed as increase in intracellular calcium...
In DepthDetails ArticlePubMed
TargetMetabotropic glutamate receptor 7(Homo sapiens (Human))
University of Paris
Curated by ChEMBL
LigandPNGBDBM50255388(CHEMBL4093492)
Affinity DataEC50: >1.00E+6nM. Assay description: Agonist activity at mGlu7 (unknown origin) expressed in HEK293 cells coexpressing chimeric Gq/i protein assessed as [3H]inositol phosphate accumulati...
In DepthDetails ArticlePubMed