BDBM50260429 CHEMBL4060638
SMILES COC(=O)[C@H]1C[C@H](CC(C)C)N(C(=O)c2ccccn2)[C@@]11C(=O)Nc2ccccc12
InChI Key InChIKey=RIPZTBUHRWUHNC-XSSDXNQZSA-N
Data  2 IC50
  Tab Delimited (TSV)   2D SDfile   Computed 3D by Vconf -m prep SDfile
Find this compound or compounds like it in BindingDB:
Activity Spreadsheet -- Enzyme Inhibition Constant Data from BindingDB
Found 2 hits for monomerid = 50260429
TargetU5 small nuclear ribonucleoprotein 200 kDa helicase(Homo sapiens (Human))
Takeda Pharmaceutical
Curated by ChEMBL
LigandPNGBDBM50260429(CHEMBL4060638)
Affinity DataIC50: >1.00E+5nM. Assay description: Inhibition of full length recombinant human N-terminal His-tagged BRR2 RNA dependent ATPase activity expressed in baculovirus infected Sf9 cells usin...
Ligand InfoPC cidPC sid
In DepthDetails ArticlePubMed
TargetU5 small nuclear ribonucleoprotein 200 kDa helicase(Homo sapiens (Human))
Takeda Pharmaceutical
Curated by ChEMBL
LigandPNGBDBM50260429(CHEMBL4060638)
Affinity DataIC50: >1.00E+5nM. Assay description: Inhibition of full length recombinant human N-terminal His-tagged BRR2 RNA dependent ATPase activity expressed in baculovirus infected Sf9 cells usin...
Ligand InfoPC cidPC sid
In DepthDetails ArticlePubMed