BDBM50263240 9-(2,6-difluorobenzyl)-6-amino-2-butoxy-7H-purin-8(9H)-one::CHEMBL475917
SMILES CCCCOc1nc(N)c2[nH]c(=O)n(Cc3c(F)cccc3F)c2n1
InChI Key InChIKey=FFFXNCSCYRJTDZ-UHFFFAOYSA-N
Data  1 IC50
  Tab Delimited (TSV)   2D SDfile   Computed 3D by Vconf -m prep SDfile
Find this compound or compounds like it in BindingDB:
Activity Spreadsheet -- Enzyme Inhibition Constant Data from BindingDB
Found 1 hit for monomerid = 50263240
TargetGlutamate racemase(Enterococcus faecalis)
Astrazeneca R&D Boston
Curated by ChEMBL
LigandPNGBDBM50263240(9-(2,6-difluorobenzyl)-6-amino-2-butoxy-7H-purin-8...)
Affinity DataIC50:  3.81E+4nM. Assay description: Inhibition of Enterococcus faecalis MurI
In DepthDetails ArticlePubMed