BDBM50264281 CHEMBL4061464
SMILES Cc1ccn2ccnc2c1N1CCCN(CC2CCCN(C2)C(=O)C2CCCC2)CC1
InChI Key InChIKey=QQGXSPRGOJREHA-UHFFFAOYSA-N
Data  2 KI
  Tab Delimited (TSV)   2D SDfile   Computed 3D by Vconf -m prep SDfile
Find this compound or compounds like it in BindingDB:
Activity Spreadsheet -- Enzyme Inhibition Constant Data from BindingDB
Found 2 hits for monomerid = 50264281
TargetAtypical chemokine receptor 3(Homo sapiens (Human))
Pfizer
Curated by ChEMBL
LigandPNGBDBM50264281(CHEMBL4061464)
Affinity DataKi:  7.94E+3nM. Assay description: Displacement of [125I]CXCL12 from human CXCR7 expressed in CHO-K1 cell membranes after 2 hrs by scintillation counting method
In DepthDetails ArticlePubMed
TargetAtypical chemokine receptor 3(Homo sapiens (Human))
Pfizer
Curated by ChEMBL
LigandPNGBDBM50264281(CHEMBL4061464)
Affinity DataKi: >8.50E+3nM. Assay description: Displacement of [125I]CXCL12 from human CXCR7 expressed in CHO-K1 cell membranes after 2 hrs by scintillation counting method
In DepthDetails ArticlePubMed