BDBM50265994 CHEMBL4068393
SMILES OC(=O)C(F)(F)F.OC(=O)C(F)(F)F.OC(=O)C(F)(F)F.OC(=O)C(F)(F)F.[3H]CC([3H])C(=O)NC1CN(CCCCC2CCN(CC(=O)N3c4ccccc4NC(=O)c4ccccc34)CC2)CCN(CCCCC2CCN(CC(=O)N3c4ccccc4NC(=O)c4ccccc34)CC2)C1
InChI Key InChIKey=ICZVKTVMHVHOQI-UHFFFAOYSA-N
Data  1 KI  3 Kd
  Tab Delimited (TSV)   2D SDfile   Computed 3D by Vconf -m prep SDfile
Find this compound or compounds like it in BindingDB:
Activity Spreadsheet -- Enzyme Inhibition Constant Data from BindingDB
Found 4 hits for monomerid = 50265994
TargetMuscarinic acetylcholine receptor M2(Homo sapiens (Human))
University Of Regensburg
Curated by ChEMBL
LigandPNGBDBM50265994(CHEMBL4068393)
Affinity DataKi:  0.710nM. Assay description: Displacement of [3H]NMS from human muscarinic acetylcholine receptor M2 expressed in CHOK9 cells after 3 hrs by liquid scintillation counting assay
In DepthDetails ArticlePubMed
TargetMuscarinic acetylcholine receptor M2(Homo sapiens (Human))
University Of Regensburg
Curated by ChEMBL
LigandPNGBDBM50265994(CHEMBL4068393)
Affinity DataKd:  8.40nM. Assay description: Binding affinity to human muscarinic acetylcholine receptor M2 expressed in live adherent CHOK9 cells after 2 hrs by liquid scintillation counting as...
In DepthDetails ArticlePubMed
TargetMuscarinic acetylcholine receptor M2(Homo sapiens (Human))
University Of Regensburg
Curated by ChEMBL
LigandPNGBDBM50265994(CHEMBL4068393)
Affinity DataKd:  3nM. Assay description: Binding affinity to human muscarinic acetylcholine receptor M2 expressed in CHOK9 cell homogenate after 2 hrs by liquid scintillation counting assay
In DepthDetails ArticlePubMed
TargetMuscarinic acetylcholine receptor M2(Homo sapiens (Human))
University Of Regensburg
Curated by ChEMBL
LigandPNGBDBM50265994(CHEMBL4068393)
Affinity DataKd:  4.60nM. Assay description: Binding affinity to human muscarinic acetylcholine receptor M2 expressed in CHOK9 cell homogenate assessed as ratio of dissociation rate constant to ...
In DepthDetails ArticlePubMed