BDBM50266600 CHEMBL476823::ethyl 3-(3,5-dimethyl-1H-pyrrol-2-yl)-4,4,4-trifluoro-3-hydroxybutanoate
SMILES CCOC(=O)CC(O)(c1[nH]c(C)cc1C)C(F)(F)F
InChI Key InChIKey=JXCZTWRGVDJILF-UHFFFAOYSA-N
Data  1 IC50
  Tab Delimited (TSV)   2D SDfile   Computed 3D by Vconf -m prep SDfile
Find this compound or compounds like it in BindingDB:
Activity Spreadsheet -- Enzyme Inhibition Constant Data from BindingDB
Found 1 hit for monomerid = 50266600
TargetFructose-1,6-bisphosphatase 1(Mus musculus)
University Of Massachusetts
Curated by ChEMBL
LigandPNGBDBM50266600(CHEMBL476823 | ethyl 3-(3,5-dimethyl-1H-pyrrol-2-y...)
Affinity DataIC50:  4.81E+3nM. Assay description: Inhibition of fructose-1,6-bisphosphatase in mouse liver homogenates by colorimetric phosphate assay
In DepthDetails ArticlePubMed