BDBM50269852 CHEMBL4062259
SMILES CC(=O)N1CCc2c(C1)c(nn2[C@H]1CCOC1)N1CCCc2cc(-c3cnn(C)c3)c(C)cc12
InChI Key InChIKey=LNXHPKSRUBGMFK-NRFANRHFSA-N
Data  3 IC50
  Tab Delimited (TSV)   2D SDfile   Computed 3D by Vconf -m prep SDfile
Find this compound or compounds like it in BindingDB:
Activity Spreadsheet -- Enzyme Inhibition Constant Data from BindingDB
Found 3 hits for monomerid = 50269852
TargetCREB-binding protein(Homo sapiens (Human))
Genentech
Curated by ChEMBL
LigandPNGBDBM50269852(CHEMBL4062259)
Affinity DataIC50:  120nM. Assay description: Inhibition of Halo-tagged histone H3.3 binding to NanoLuc luciferase conjugated human CBP expressed in HEK293 cells after overnight incubation by BRE...
In DepthDetails ArticlePubMed
TargetBromodomain-containing protein 4(Homo sapiens (Human))
Genentech
Curated by ChEMBL
LigandPNGBDBM50269852(CHEMBL4062259)
Affinity DataIC50:  7.30E+3nM. Assay description: Displacement of biotinylated histone H3K14 peptide ligand from human recombinant His-tagged BRD4 bromodomain-1 measured after 10 mins by TR-FRET assa...
In DepthDetails ArticlePubMed
TargetCREB-binding protein(Homo sapiens (Human))
Genentech
Curated by ChEMBL
LigandPNGBDBM50269852(CHEMBL4062259)
Affinity DataIC50:  4.40nM. Assay description: Displacement of biotinylated histone H3K14 peptide ligand from human recombinant His-tagged CBP measured after 10 mins by TR-FRET assay
In DepthDetails ArticlePubMed